running 1 test test os_service_registry_discovery_negative ... FAILED failures: failures: os_service_registry_discovery_negative test result: FAILED. 0 passed; 1 failed; 0 ignored; 0 measured; 8 filtered out; finished in 0.00s thread 'os_service_registry_discovery_negative' (48889007) panicked at /reports/os-implementation/K1400-service-registry-discovery-local-preflight-NQvSmY/workspace/userspace/tests/service_registry.rs:273:5: assertion `left == right` failed left: Ok(Binding { name: Name { bytes: [97, 100, 109, 105, 110, 0, 0, 0, 0, 0, 0, 0, 0, 0, 0, 0, 0, 0, 0, 0, 0, 0, 0, 0], len: 5 }, publisher: PublisherId { slot: 1, generation: 7 }, endpoint: 163 }) right: Err(NotFound) note: run with `RUST_BACKTRACE=1` environment variable to display a backtrace