running 1 test test os_entry_level_negative ... FAILED failures: failures: os_entry_level_negative test result: FAILED. 0 passed; 1 failed; 0 ignored; 0 measured; 8 filtered out; finished in 0.00s Compiling turkos-os-entry-level v0.1.0 (/reports/os-implementation/K621-K624-T4sejM/mutant-accept-el2/os-entry-level) Finished `test` profile [unoptimized + debuginfo] target(s) in 0.18s Running tests/level.rs (reports/os-implementation/K621-K624-T4sejM/mutant-accept-el2/target/debug/build/turkos-os-entry-level/668801ca52b216e7/out/level-668801ca52b216e7) thread 'os_entry_level_negative' (39871073) panicked at tests/level.rs:27:9: assertion `left == right` failed left: Ok(Normalized { level: 1, daif_masked: 960, stack_offset: 16128 }) right: Err(UnsupportedLevel) note: run with `RUST_BACKTRACE=1` environment variable to display a backtrace error: test failed, to rerun pass `--test level`