running 1 test test unserviced_token_cannot_complete_or_release_source ... FAILED failures: ---- unserviced_token_cannot_complete_or_release_source stdout ---- thread 'unserviced_token_cannot_complete_or_release_source' (41615720) panicked at tests/deferred_work.rs:707:48: called `Result::unwrap_err()` on an `Ok` value: () note: run with `RUST_BACKTRACE=1` environment variable to display a backtrace failures: unserviced_token_cannot_complete_or_release_source test result: FAILED. 0 passed; 1 failed; 0 ignored; 0 measured; 27 filtered out; finished in 0.00s Compiling turkos-os-deferred-work v0.1.0 (/reports/os-implementation/K981-K999-preparation-0bsVMr/mutant-unserviced-credit/os-deferred-work) Finished `test` profile [unoptimized + debuginfo] target(s) in 0.49s Running tests/deferred_work.rs (reports/os-implementation/K981-K999-preparation-0bsVMr/mutant-unserviced-credit/target/debug/build/turkos-os-deferred-work/bfb4bf5e81b06a44/out/deferred_work-bfb4bf5e81b06a44) error: test failed, to rerun pass `--test deferred_work`