running 1 test test threads::exhaustion_tests::sleep_epoch_exhaustion_keeps_running_thread_and_backing ... FAILED failures: failures: threads::exhaustion_tests::sleep_epoch_exhaustion_keeps_running_thread_and_backing test result: FAILED. 0 passed; 1 failed; 0 ignored; 0 measured; 3 filtered out; finished in 0.00s Compiling turkos-os-threads v0.1.0 (/reports/os-implementation/K1001-K1019-preparation-Vy7GRN/mutant-sleep-epoch-wrap/os-threads) Finished `test` profile [unoptimized + debuginfo] target(s) in 0.17s Running unittests src/lib.rs (reports/os-implementation/K1001-K1019-preparation-Vy7GRN/mutant-sleep-epoch-wrap/target/debug/build/turkos-os-threads/7ae6daa76234915d/out/turkos_os_threads-7ae6daa76234915d) thread 'threads::exhaustion_tests::sleep_epoch_exhaustion_keeps_running_thread_and_backing' (41561969) panicked at src/threads.rs:613:9: assertion `left == right` failed left: None right: Some(Exhausted) note: run with `RUST_BACKTRACE=1` environment variable to display a backtrace error: test failed, to rerun pass `--lib`