running 1 test test os_waitsets_deadlines_negative ... FAILED failures: failures: os_waitsets_deadlines_negative test result: FAILED. 0 passed; 1 failed; 0 ignored; 0 measured; 2 filtered out; finished in 0.00s thread 'os_waitsets_deadlines_negative' (48647402) panicked at /reports/os-implementation/K1355-waitset-deadlines-local-preflight-7dhwdB/workspace/kernel/tests/os/waitset_deadlines.rs:42:5: assertion `left == right` failed left: Ok(()) right: Err(Stale) note: run with `RUST_BACKTRACE=1` environment variable to display a backtrace