running 1 test test os_handles_generation_negative ... FAILED failures: failures: os_handles_generation_negative test result: FAILED. 0 passed; 1 failed; 0 ignored; 0 measured; 1 filtered out; finished in 0.00s thread 'os_handles_generation_negative' (48421178) panicked at /reports/os-implementation/K1310-handles-generation-local-preflight-AKLmvQ/workspace/kernel/tests/os/handles_generation.rs:44:5: assertion `left == right` failed left: Ok(Handle(1)) right: Err(IdExhausted) note: run with `RUST_BACKTRACE=1` environment variable to display a backtrace