running 1 test test copy_fault_does_not_publish ... FAILED failures: failures: copy_fault_does_not_publish test result: FAILED. 0 passed; 1 failed; 0 ignored; 0 measured; 2 filtered out; finished in 0.00s thread 'copy_fault_does_not_publish' (48495240) panicked at /reports/os-implementation/K1325-handles-queue-local-preflight-b1QWVr/workspace/kernel/tests/os/handles_queue.rs:68:5: assertion `left == right` failed left: Ok(()) right: Err(Fault) note: run with `RUST_BACKTRACE=1` environment variable to display a backtrace