running 2 tests test os_vfs_paths_symlink_positive ... ok test os_vfs_paths_symlink_negative ... FAILED failures: ---- os_vfs_paths_symlink_negative stdout ---- thread 'os_vfs_paths_symlink_negative' (49956173) panicked at /reports/os-implementation/K1560-vfs-symlink-local-ly6b2A/mutant/kernel/tests/os/vfs_symlink.rs:38:5: assertion `left == right` failed left: Err(Eloop(41)) right: Err(Eloop(40)) note: run with `RUST_BACKTRACE=1` environment variable to display a backtrace failures: os_vfs_paths_symlink_negative test result: FAILED. 1 passed; 1 failed; 0 ignored; 0 measured; 0 filtered out; finished in 0.00s