running 1 test test clock::exhaustion_tests::retired_slot_is_skipped_so_another_owner_can_still_progress ... FAILED failures: failures: clock::exhaustion_tests::retired_slot_is_skipped_so_another_owner_can_still_progress test result: FAILED. 0 passed; 1 failed; 0 ignored; 0 measured; 5 filtered out; finished in 0.00s Compiling turkos-os-clock v0.1.0 (/reports/os-implementation/K941-K959-preparation-T8L8pi/mutant-retired-slot-picked/os-clock) Finished `test` profile [unoptimized + debuginfo] target(s) in 0.21s Running unittests src/lib.rs (reports/os-implementation/K941-K959-preparation-T8L8pi/mutant-retired-slot-picked/target/debug/build/turkos-os-clock/a3ef14b6317177d5/out/turkos_os_clock-a3ef14b6317177d5) thread 'clock::exhaustion_tests::retired_slot_is_skipped_so_another_owner_can_still_progress' (41398601) panicked at src/clock.rs:567:44: called `Result::unwrap()` on an `Err` value: Exhausted note: run with `RUST_BACKTRACE=1` environment variable to display a backtrace error: test failed, to rerun pass `--lib`