running 1 test test internally_issued_namespace_separates_identical_source_and_job_records ... FAILED failures: ---- internally_issued_namespace_separates_identical_source_and_job_records stdout ---- thread 'internally_issued_namespace_separates_identical_source_and_job_records' (41612095) panicked at tests/deferred_work.rs:313:5: assertion `left != right` failed left: 1 right: 1 note: run with `RUST_BACKTRACE=1` environment variable to display a backtrace failures: internally_issued_namespace_separates_identical_source_and_job_records test result: FAILED. 0 passed; 1 failed; 0 ignored; 0 measured; 27 filtered out; finished in 0.00s Compiling turkos-os-deferred-work v0.1.0 (/reports/os-implementation/K981-K999-preparation-0bsVMr/mutant-caller-reused-namespace/os-deferred-work) warning: function `next_identity` is never used --> src/deferred_work.rs:497:4 | 497 | fn next_identity(current: u64) -> Result { | ^^^^^^^^^^^^^ | = note: `#[warn(dead_code)]` (part of `#[warn(unused)]`) on by default warning: function `identity` is never used --> src/deferred_work.rs:502:4 | 502 | fn identity() -> Result { | ^^^^^^^^ warning: `turkos-os-deferred-work` (lib) generated 2 warnings Finished `test` profile [unoptimized + debuginfo] target(s) in 0.52s Running tests/deferred_work.rs (reports/os-implementation/K981-K999-preparation-0bsVMr/mutant-caller-reused-namespace/target/debug/build/turkos-os-deferred-work/bfb4bf5e81b06a44/out/deferred_work-bfb4bf5e81b06a44) error: test failed, to rerun pass `--test deferred_work`