running 1 test test os_handles_types_negative ... FAILED failures: failures: os_handles_types_negative test result: FAILED. 0 passed; 1 failed; 0 ignored; 0 measured; 2 filtered out; finished in 0.00s thread 'os_handles_types_negative' (48396098) panicked at /reports/os-implementation/K1305-handles-local-preflight-aRcWoZ/workspace/kernel/tests/os/handles.rs:47:5: assertion `left == right` failed left: Ok(0) right: Err(BadFd) note: run with `RUST_BACKTRACE=1` environment variable to display a backtrace