running 1 test test stale_owner_or_root_stops_before_page_walks ... FAILED failures: ---- stale_owner_or_root_stops_before_page_walks stdout ---- thread 'stale_owner_or_root_stops_before_page_walks' (41252759) panicked at tests/exceptions.rs:365:9: assertion `left == right` failed left: Err(Entry) right: Err(Owner) note: run with `RUST_BACKTRACE=1` environment variable to display a backtrace failures: stale_owner_or_root_stops_before_page_walks test result: FAILED. 0 passed; 1 failed; 0 ignored; 0 measured; 22 filtered out; finished in 0.00s Compiling turkos-os-exceptions v0.1.0 (/reports/os-implementation/K901-K919-preparation-EQ5mcc/mutant-missing-owner-root/os-exceptions) Finished `test` profile [unoptimized + debuginfo] target(s) in 0.27s Running tests/exceptions.rs (reports/os-implementation/K901-K919-preparation-EQ5mcc/mutant-missing-owner-root/target/debug/build/turkos-os-exceptions/75414a6222e92fd7/out/exceptions-75414a6222e92fd7) error: test failed, to rerun pass `--test exceptions`