running 1 test test guard_canary_stack_alignment_and_capture_address_refuse_before_prepare ... FAILED failures: failures: guard_canary_stack_alignment_and_capture_address_refuse_before_prepare test result: FAILED. 0 passed; 1 failed; 0 ignored; 0 measured; 32 filtered out; finished in 0.00s Compiling turkos-os-threads v0.1.0 (/reports/os-implementation/K1021-K1039-preparation-EkLAoy/mutant-canaries-ignored/os-threads) Compiling turkos-os-exceptions v0.1.0 (/reports/os-implementation/K1021-K1039-preparation-EkLAoy/mutant-canaries-ignored/os-exceptions) Compiling turkos-os-context-switch v0.1.0 (/reports/os-implementation/K1021-K1039-preparation-EkLAoy/mutant-canaries-ignored/os-context-switch) Finished `test` profile [unoptimized + debuginfo] target(s) in 0.42s Running tests/context.rs (reports/os-implementation/K1021-K1039-preparation-EkLAoy/mutant-canaries-ignored/target/debug/build/turkos-os-context-switch/225e5b403007ef19/out/context-225e5b403007ef19) thread 'guard_canary_stack_alignment_and_capture_address_refuse_before_prepare' (41792776) panicked at tests/context.rs:361:9: assertion failed: bank.cooperate(a, b, c).is_err() note: run with `RUST_BACKTRACE=1` environment variable to display a backtrace error: test failed, to rerun pass `--test context`