running 1 test test os_frame_authority_audit_negative ... FAILED failures: failures: os_frame_authority_audit_negative test result: FAILED. 0 passed; 1 failed; 0 ignored; 0 measured; 30 filtered out; finished in 0.00s Compiling typenum v1.20.1 Compiling libc v0.2.190 Compiling cfg-if v1.0.5 Compiling turkos-os-runtime-platform v0.1.0 (/os-runtime-platform) Compiling turkos-bootinfo v0.0.1 (/bootinfo) Compiling turkos-os-frame-authority v0.1.0 (/reports/os-implementation/K701-K719-xtYvXL/mutant-count-only-inventory/os-frame-authority) Compiling hybrid-array v0.4.15 Compiling crypto-common v0.2.2 Compiling block-buffer v0.12.1 Compiling cpufeatures v0.3.1 Compiling digest v0.11.3 Compiling sha2 v0.11.0 Compiling turkos-kernel v0.0.1 (/kernel) Finished `test` profile [unoptimized + debuginfo] target(s) in 1.70s Running tests/authority.rs (reports/os-implementation/K701-K719-xtYvXL/mutant-count-only-inventory/target/debug/build/turkos-os-frame-authority/792e65cf72b590ff/out/authority-792e65cf72b590ff) thread 'os_frame_authority_audit_negative' (40944478) panicked at tests/authority.rs:482:5: assertion `left == right` failed left: Ok(Audit { ram_full_pages: 8, firmware_withheld_pages: 0, boot_reserved_pages: 0, authorized_pages: 8, free_pages: 6, reserved_pages: 0, live_pages: 2 }) right: Err(Audit) note: run with `RUST_BACKTRACE=1` environment variable to display a backtrace error: test failed, to rerun pass `--test authority`