running 2 tests test os_pci_discovery_bridges_positive ... ok test os_pci_discovery_bridges_negative ... FAILED failures: ---- os_pci_discovery_bridges_negative stdout ---- thread 'os_pci_discovery_bridges_negative' (49119653) panicked at /reports/os-implementation/K1440-pci-bridges-local-Irnjyn/mutant/kernel/tests/os/pci_bridges.rs:31:5: assertion `left == right` failed left: Err(InvalidWindow) right: Err(SecondaryCollision) note: run with `RUST_BACKTRACE=1` environment variable to display a backtrace failures: os_pci_discovery_bridges_negative test result: FAILED. 1 passed; 1 failed; 0 ignored; 0 measured; 0 filtered out; finished in 0.00s