running 1 test test unaligned_stack_pointer_rejected_without_activation ... FAILED failures: failures: unaligned_stack_pointer_rejected_without_activation test result: FAILED. 0 passed; 1 failed; 0 ignored; 0 measured; 15 filtered out; finished in 0.00s Compiling turkos-os-entry-stack v0.1.0 (/reports/os-implementation/K631-K634-LXwIFy/mutant-ignore-alignment/os-entry-stack) Finished `test` profile [unoptimized + debuginfo] target(s) in 0.20s Running tests/stack.rs (reports/os-implementation/K631-K634-LXwIFy/mutant-ignore-alignment/target/debug/build/turkos-os-entry-stack/9a136f43a262b3f2/out/stack-9a136f43a262b3f2) thread 'unaligned_stack_pointer_rejected_without_activation' (40759134) panicked at tests/stack.rs:93:5: assertion `left == right` failed left: Ok(16383) right: Err(StackPointer) note: run with `RUST_BACKTRACE=1` environment variable to display a backtrace error: test failed, to rerun pass `--test stack`