running 1 test test same_device_new_epoch_never_coalesces_or_executes_replacement_callback ... FAILED failures: ---- same_device_new_epoch_never_coalesces_or_executes_replacement_callback stdout ---- thread 'same_device_new_epoch_never_coalesces_or_executes_replacement_callback' (41613383) panicked at tests/deferred_work.rs:434:5: assertion `left == right` failed left: 1 right: 2 note: run with `RUST_BACKTRACE=1` environment variable to display a backtrace failures: same_device_new_epoch_never_coalesces_or_executes_replacement_callback test result: FAILED. 0 passed; 1 failed; 0 ignored; 0 measured; 27 filtered out; finished in 0.00s Compiling turkos-os-deferred-work v0.1.0 (/reports/os-implementation/K981-K999-preparation-0bsVMr/mutant-cross-generation-coalescing/os-deferred-work) Finished `test` profile [unoptimized + debuginfo] target(s) in 0.53s Running tests/deferred_work.rs (reports/os-implementation/K981-K999-preparation-0bsVMr/mutant-cross-generation-coalescing/target/debug/build/turkos-os-deferred-work/bfb4bf5e81b06a44/out/deferred_work-bfb4bf5e81b06a44) error: test failed, to rerun pass `--test deferred_work`