running 1 test test preparation_failure_returns_same_actual_backing_without_publication ... FAILED failures: failures: preparation_failure_returns_same_actual_backing_without_publication test result: FAILED. 0 passed; 1 failed; 0 ignored; 0 measured; 21 filtered out; finished in 0.00s Compiling turkos-os-threads v0.1.0 (/reports/os-implementation/K1001-K1019-preparation-Vy7GRN/mutant-publish-before-prepare/os-threads) Finished `test` profile [unoptimized + debuginfo] target(s) in 0.28s Running tests/threads.rs (reports/os-implementation/K1001-K1019-preparation-Vy7GRN/mutant-publish-before-prepare/target/debug/build/turkos-os-threads/fc0d96e38d2f6d6f/out/threads-fc0d96e38d2f6d6f) thread 'preparation_failure_returns_same_actual_backing_without_publication' (41559857) panicked at tests/threads.rs:313:5: assertion `left == right` failed left: 1 right: 0 note: run with `RUST_BACKTRACE=1` environment variable to display a backtrace error: test failed, to rerun pass `--test threads`