running 1 test test level_triggered_poll_repeats_until_source_clears ... FAILED failures: failures: level_triggered_poll_repeats_until_source_clears test result: FAILED. 0 passed; 1 failed; 0 ignored; 0 measured; 2 filtered out; finished in 0.00s thread 'level_triggered_poll_repeats_until_source_clears' (48618238) panicked at /reports/os-implementation/K1350-waitset-readiness-local-preflight-5IwtO3/workspace/kernel/tests/os/waitset_readiness.rs:17:5: assertion `left == right` failed left: Ok(None) right: Ok(Some(Interest(1))) note: run with `RUST_BACKTRACE=1` environment variable to display a backtrace