running 1 test test os_kernel_heap_release_negative ... FAILED failures: ---- os_kernel_heap_release_negative stdout ---- thread 'os_kernel_heap_release_negative' (40963417) panicked at tests/heap.rs:167:5: assertion `left == right` failed left: Ok(()) right: Err(ForeignPointer) note: run with `RUST_BACKTRACE=1` environment variable to display a backtrace failures: os_kernel_heap_release_negative test result: FAILED. 0 passed; 1 failed; 0 ignored; 0 measured; 12 filtered out; finished in 0.00s Compiling turkos-os-kernel-heap v0.1.0 (/reports/os-implementation/K761-K779-preparation-KNIrm3/mutant-inner-pointer/os-kernel-heap) warning: unused variable: `pointer` --> src/heap.rs:391:9 | 391 | pointer: usize, | ^^^^^^^ help: if this is intentional, prefix it with an underscore: `_pointer` | = note: `#[warn(unused_variables)]` (part of `#[warn(unused)]`) on by default warning: `turkos-os-kernel-heap` (lib) generated 1 warning (run `cargo fix --lib -p turkos-os-kernel-heap` to apply 1 suggestion) Finished `test` profile [unoptimized + debuginfo] target(s) in 0.30s Running tests/heap.rs (reports/os-implementation/K761-K779-preparation-KNIrm3/mutant-inner-pointer/target/debug/build/turkos-os-kernel-heap/04dbad547e5317ad/out/heap-04dbad547e5317ad) error: test failed, to rerun pass `--test heap`