running 1 test test running_multiplicity_is_immutable_and_new_irq_gets_another_lease ... FAILED failures: ---- running_multiplicity_is_immutable_and_new_irq_gets_another_lease stdout ---- thread 'running_multiplicity_is_immutable_and_new_irq_gets_another_lease' (41613705) panicked at tests/deferred_work.rs:457:5: assertion failed: matches!(q.enqueue(&r, 3, IRQ).unwrap(), Enqueued::New(_)) note: run with `RUST_BACKTRACE=1` environment variable to display a backtrace failures: running_multiplicity_is_immutable_and_new_irq_gets_another_lease test result: FAILED. 0 passed; 1 failed; 0 ignored; 0 measured; 27 filtered out; finished in 0.00s Compiling turkos-os-deferred-work v0.1.0 (/reports/os-implementation/K981-K999-preparation-0bsVMr/mutant-running-work-coalescing/os-deferred-work) Finished `test` profile [unoptimized + debuginfo] target(s) in 0.52s Running tests/deferred_work.rs (reports/os-implementation/K981-K999-preparation-0bsVMr/mutant-running-work-coalescing/target/debug/build/turkos-os-deferred-work/bfb4bf5e81b06a44/out/deferred_work-bfb4bf5e81b06a44) error: test failed, to rerun pass `--test deferred_work`