running 1 test test granted_waiter_remains_owner_until_claim_and_newcomers_cannot_barge ... FAILED failures: failures: granted_waiter_remains_owner_until_claim_and_newcomers_cannot_barge test result: FAILED. 0 passed; 1 failed; 0 ignored; 0 measured; 33 filtered out; finished in 0.00s Compiling turkos-os-locking v0.1.0 (/reports/os-implementation/K961-K979-preparation-HHDGYT/mutant-mutex-newcomer-barges/os-locking) Finished `test` profile [unoptimized + debuginfo] target(s) in 0.43s Running tests/locking.rs (reports/os-implementation/K961-K979-preparation-HHDGYT/mutant-mutex-newcomer-barges/target/debug/build/turkos-os-locking/36db3b80b1dba7b1/out/locking-36db3b80b1dba7b1) thread 'granted_waiter_remains_owner_until_claim_and_newcomers_cannot_barge' (41478965) panicked at tests/locking.rs:803:60: called `Result::unwrap()` on an `Err` value: Quarantined note: run with `RUST_BACKTRACE=1` environment variable to display a backtrace error: test failed, to rerun pass `--test locking`