running 2 tests test os_partitions_gpt_positive ... ok test os_partitions_gpt_negative ... FAILED failures: ---- os_partitions_gpt_negative stdout ---- thread 'os_partitions_gpt_negative' (49805821) panicked at /reports/os-implementation/K1530-partitions-gpt-local-ficXiQ/mutant/kernel/tests/os/partitions_gpt.rs:121:5: assertion `left == right` failed left: Err(InconsistentCopies) right: Err(BadArrayCrc) note: run with `RUST_BACKTRACE=1` environment variable to display a backtrace failures: os_partitions_gpt_negative test result: FAILED. 1 passed; 1 failed; 0 ignored; 0 measured; 0 filtered out; finished in 0.01s