running 1 test test os_shared_memory_lifetime_negative ... FAILED failures: failures: os_shared_memory_lifetime_negative test result: FAILED. 0 passed; 1 failed; 0 ignored; 0 measured; 2 filtered out; finished in 0.00s thread 'os_shared_memory_lifetime_negative' (48736878) panicked at /reports/os-implementation/K1375-shared-memory-lifetime-local-preflight-G9THnP/workspace/kernel/tests/os/shared_memory_lifetime.rs:40:5: assertion `left == right` failed left: Ok(()) right: Err(Busy) note: run with `RUST_BACKTRACE=1` environment variable to display a backtrace