running 1 test test unmasked_irq_rejected ... FAILED failures: failures: unmasked_irq_rejected test result: FAILED. 0 passed; 1 failed; 0 ignored; 0 measured; 8 filtered out; finished in 0.00s Compiling turkos-os-entry-level v0.1.0 (/reports/os-implementation/K621-K624-T4sejM/mutant-ignore-daif/os-entry-level) Finished `test` profile [unoptimized + debuginfo] target(s) in 0.18s Running tests/level.rs (reports/os-implementation/K621-K624-T4sejM/mutant-ignore-daif/target/debug/build/turkos-os-entry-level/668801ca52b216e7/out/level-668801ca52b216e7) thread 'unmasked_irq_rejected' (39871226) panicked at tests/level.rs:37:5: assertion `left == right` failed left: Ok(Normalized { level: 1, daif_masked: 832, stack_offset: 16128 }) right: Err(InterruptUnmasked) note: run with `RUST_BACKTRACE=1` environment variable to display a backtrace error: test failed, to rerun pass `--test level`