running 1 test test os_runqueue_enqueue_negative ... FAILED failures: failures: os_runqueue_enqueue_negative test result: FAILED. 0 passed; 1 failed; 0 ignored; 0 measured; 21 filtered out; finished in 0.00s Compiling turkos-os-threads v0.1.0 (/reports/os-implementation/K1041-K1059-preparation-5hOulI/mutant-duplicate-admission/os-threads) Compiling turkos-os-exceptions v0.1.0 (/reports/os-implementation/K1041-K1059-preparation-5hOulI/mutant-duplicate-admission/os-exceptions) Compiling turkos-os-context-switch v0.1.0 (/reports/os-implementation/K1041-K1059-preparation-5hOulI/mutant-duplicate-admission/os-context-switch) Compiling turkos-os-runqueue v0.1.0 (/reports/os-implementation/K1041-K1059-preparation-5hOulI/mutant-duplicate-admission/os-runqueue) Finished `test` profile [unoptimized + debuginfo] target(s) in 0.68s Running tests/runqueue.rs (reports/os-implementation/K1041-K1059-preparation-5hOulI/mutant-duplicate-admission/target/debug/build/turkos-os-runqueue/6f4f57ffb93ae3cb/out/runqueue-6f4f57ffb93ae3cb) thread 'os_runqueue_enqueue_negative' (41915080) panicked at tests/runqueue.rs:26:14: explicit panic note: run with `RUST_BACKTRACE=1` environment variable to display a backtrace error: test failed, to rerun pass `--test runqueue`