running 2 tests test os_vfs_paths_stat_positive ... ok test os_vfs_paths_stat_negative ... FAILED failures: ---- os_vfs_paths_stat_negative stdout ---- thread 'os_vfs_paths_stat_negative' (50025276) panicked at /reports/os-implementation/K1575-vfs-stat-local-so0qp5/mutant/kernel/tests/os/vfs_stat.rs:53:5: assertion `left == right` failed left: Ok(Catalog { root: Inode { number: 1, kind: Directory, permissions: 365, uid: 0, gid: 0, size: 64, allocated_bytes: 512 }, names: [Name { bytes: [98, 111, 115, 0, 0, 0, 0, 0, 0, 0, 0, 0, 0, 0, 0, 0, 0, 0, 0, 0, 0, 0, 0, 0], len: 3 }, Name { bytes: [98, 117, 121, 117, 107, 0, 0, 0, 0, 0, 0, 0, 0, 0, 0, 0, 0, 0, 0, 0, 0, 0, 0, 0], len: 5 }], files: [Inode { number: 2, kind: Regular, permissions: 292, uid: 0, gid: 0, size: 0, allocated_bytes: 0 }, Inode { number: 3, kind: Regular, permissions: 292, uid: 0, gid: 0, size: 1025, allocated_bytes: 1024 }] }) right: Err(CorruptInodeSize) note: run with `RUST_BACKTRACE=1` environment variable to display a backtrace failures: os_vfs_paths_stat_negative test result: FAILED. 1 passed; 1 failed; 0 ignored; 0 measured; 0 filtered out; finished in 0.00s