running 4 tests test os_block_io_requests_negative ... ok test os_block_io_requests_positive ... ok test os_block_io_timeouts_positive ... ok test os_block_io_timeouts_negative ... FAILED failures: ---- os_block_io_timeouts_negative stdout ---- thread 'os_block_io_timeouts_negative' (49710386) panicked at /reports/os-implementation/K1515-block-timeouts-local-LMaURe/mutant/kernel/tests/os/block_io.rs:88:40: called `Result::unwrap()` on an `Err` value: UnknownRequest note: run with `RUST_BACKTRACE=1` environment variable to display a backtrace failures: os_block_io_timeouts_negative test result: FAILED. 3 passed; 1 failed; 0 ignored; 0 measured; 0 filtered out; finished in 0.00s