running 1 test test os_shell_words_rejects_unterminated_escape_nul_and_capacity ... FAILED failures: ---- os_shell_words_rejects_unterminated_escape_nul_and_capacity stdout ---- thread 'os_shell_words_rejects_unterminated_escape_nul_and_capacity' (48120250) panicked at tests/words.rs:16:5: assertion failed: matches!(Words::<16, 3>::parse("echo 'bad"), Err(Error::UnterminatedQuote)) note: run with `RUST_BACKTRACE=1` environment variable to display a backtrace failures: os_shell_words_rejects_unterminated_escape_nul_and_capacity test result: FAILED. 0 passed; 1 failed; 0 ignored; 0 measured; 2 filtered out; finished in 0.00s Compiling turkos-os-shell-words v0.1.0 (/reports/os-implementation/K1265-words-local-preflight-P60D3D/workspace/os-shell-words) Finished `test` profile [unoptimized + debuginfo] target(s) in 0.13s Running tests/words.rs (reports/os-implementation/K1265-words-local-preflight-P60D3D/target/debug/build/turkos-os-shell-words/de3d826476110296/out/words-de3d826476110296) error: test failed, to rerun pass `--test words`