running 1 test test known_nonconventional_types_are_all_withheld ... FAILED failures: failures: known_nonconventional_types_are_all_withheld test result: FAILED. 0 passed; 1 failed; 0 ignored; 0 measured; 30 filtered out; finished in 0.00s Compiling typenum v1.20.1 Compiling libc v0.2.190 Compiling cfg-if v1.0.5 Compiling turkos-bootinfo v0.0.1 (/bootinfo) Compiling turkos-os-runtime-platform v0.1.0 (/os-runtime-platform) Compiling turkos-os-frame-authority v0.1.0 (/reports/os-implementation/K701-K719-xtYvXL/mutant-boot-services-admitted/os-frame-authority) Compiling hybrid-array v0.4.15 Compiling crypto-common v0.2.2 Compiling block-buffer v0.12.1 Compiling cpufeatures v0.3.1 Compiling digest v0.11.3 Compiling sha2 v0.11.0 Compiling turkos-kernel v0.0.1 (/kernel) Finished `test` profile [unoptimized + debuginfo] target(s) in 1.66s Running tests/authority.rs (reports/os-implementation/K701-K719-xtYvXL/mutant-boot-services-admitted/target/debug/build/turkos-os-frame-authority/792e65cf72b590ff/out/authority-792e65cf72b590ff) thread 'known_nonconventional_types_are_all_withheld' (40941855) panicked at tests/authority.rs:158:5: assertion `left == right` failed left: [1073758208, 1073770496] right: [1073770496] note: run with `RUST_BACKTRACE=1` environment variable to display a backtrace error: test failed, to rerun pass `--test authority`