running 1 test test id_capacity_fails_before_root_acquisition ... FAILED failures: ---- id_capacity_fails_before_root_acquisition stdout ---- thread 'id_capacity_fails_before_root_acquisition' (41108997) panicked at tests/spaces.rs:202:5: assertion `left == right` failed left: 3 right: 1 note: run with `RUST_BACKTRACE=1` environment variable to display a backtrace failures: id_capacity_fails_before_root_acquisition test result: FAILED. 0 passed; 1 failed; 0 ignored; 0 measured; 17 filtered out; finished in 0.00s Compiling turkos-os-address-spaces v0.1.0 (/reports/os-implementation/K821-K839-preparation-6JTwAT/mutant-early-root-acquire/os-address-spaces) Finished `test` profile [unoptimized + debuginfo] target(s) in 0.29s Running tests/spaces.rs (reports/os-implementation/K821-K839-preparation-6JTwAT/mutant-early-root-acquire/target/debug/build/turkos-os-address-spaces/8a8b018c19f35bf8/out/spaces-8a8b018c19f35bf8) error: test failed, to rerun pass `--test spaces`