running 1 test test live_one_shot_keeps_backend_until_explicit_owner_cancellation ... FAILED failures: failures: live_one_shot_keeps_backend_until_explicit_owner_cancellation test result: FAILED. 0 passed; 1 failed; 0 ignored; 0 measured; 20 filtered out; finished in 0.00s Compiling turkos-os-clock v0.1.0 (/reports/os-implementation/K941-K959-preparation-T8L8pi/mutant-live-backend-released/os-clock) Finished `test` profile [unoptimized + debuginfo] target(s) in 0.28s Running tests/clock.rs (reports/os-implementation/K941-K959-preparation-T8L8pi/mutant-live-backend-released/target/debug/build/turkos-os-clock/7e205e95b363aa97/out/clock-7e205e95b363aa97) thread 'live_one_shot_keeps_backend_until_explicit_owner_cancellation' (41400338) panicked at tests/clock.rs:468:18: live owner released note: run with `RUST_BACKTRACE=1` environment variable to display a backtrace error: test failed, to rerun pass `--test clock`