running 2 tests test os_vfs_unmount_positive ... FAILED test os_vfs_unmount_negative ... FAILED failures: ---- os_vfs_unmount_positive stdout ---- thread 'os_vfs_unmount_positive' (50160845) panicked at /reports/os-implementation/K1600-vfs-unmount-local-RTKaJL/mutant/kernel/tests/os/vfs_unmount.rs:16:5: assertion `left == right` failed left: Ok(8) right: Err(Busy) ---- os_vfs_unmount_negative stdout ---- thread 'os_vfs_unmount_negative' (50160844) panicked at /reports/os-implementation/K1600-vfs-unmount-local-RTKaJL/mutant/kernel/tests/os/vfs_unmount.rs:33:5: assertion `left == right` failed left: Ok(2) right: Err(Busy) note: run with `RUST_BACKTRACE=1` environment variable to display a backtrace failures: os_vfs_unmount_negative os_vfs_unmount_positive test result: FAILED. 0 passed; 2 failed; 0 ignored; 0 measured; 0 filtered out; finished in 0.00s