running 1 test test ordering_transitive_cycle_and_high_bit_node_fail_closed ... FAILED failures: failures: ordering_transitive_cycle_and_high_bit_node_fail_closed test result: FAILED. 0 passed; 1 failed; 0 ignored; 0 measured; 33 filtered out; finished in 0.00s Compiling turkos-os-locking v0.1.0 (/reports/os-implementation/K961-K979-preparation-HHDGYT/mutant-ordering-high-node-lost/os-locking) Finished `test` profile [unoptimized + debuginfo] target(s) in 0.43s Running tests/locking.rs (reports/os-implementation/K961-K979-preparation-HHDGYT/mutant-ordering-high-node-lost/target/debug/build/turkos-os-locking/36db3b80b1dba7b1/out/locking-36db3b80b1dba7b1) thread 'ordering_transitive_cycle_and_high_bit_node_fail_closed' (41480598) panicked at tests/locking.rs:1063:9: assertion failed: matches!(last.acquire(1, || Ok(())), Err(Error::Cycle)) note: run with `RUST_BACKTRACE=1` environment variable to display a backtrace error: test failed, to rerun pass `--test locking`