running 1 test test os_diagnostics_events_negative ... FAILED failures: failures: os_diagnostics_events_negative test result: FAILED. 0 passed; 1 failed; 0 ignored; 0 measured; 16 filtered out; finished in 0.00s Compiling turkos-os-runtime-diagnostics v0.1.0 (/reports/os-implementation/K661-K679-llspFW/mutant-stale-boot/os-runtime-diagnostics) Finished `test` profile [unoptimized + debuginfo] target(s) in 0.27s Running tests/diagnostics.rs (reports/os-implementation/K661-K679-llspFW/mutant-stale-boot/target/debug/build/turkos-os-runtime-diagnostics/1389b3a65c1f13ac/out/diagnostics-1389b3a65c1f13ac) thread 'os_diagnostics_events_negative' (40819654) panicked at tests/diagnostics.rs:99:5: assertion `left == right` failed left: Ok(()) right: Err(StaleBoot) note: run with `RUST_BACKTRACE=1` environment variable to display a backtrace error: test failed, to rerun pass `--test diagnostics`