running 2 tests test os_pci_device_map_positive ... ok test os_pci_device_map_negative ... FAILED failures: ---- os_pci_device_map_negative stdout ---- thread 'os_pci_device_map_negative' (49159218) panicked at /reports/os-implementation/K1450-pci-device-map-local-oDMPK6/mutant/kernel/tests/os/pci_device_map.rs:29:5: assertion `left == right` failed left: Err(Full) right: Err(OutsideAperture) note: run with `RUST_BACKTRACE=1` environment variable to display a backtrace failures: os_pci_device_map_negative test result: FAILED. 1 passed; 1 failed; 0 ignored; 0 measured; 0 filtered out; finished in 0.00s