running 1 test test irq_mask_write_failure_keeps_backend_quarantined ... FAILED failures: failures: irq_mask_write_failure_keeps_backend_quarantined test result: FAILED. 0 passed; 1 failed; 0 ignored; 0 measured; 33 filtered out; finished in 0.00s Compiling turkos-os-locking v0.1.0 (/reports/os-implementation/K961-K979-preparation-HHDGYT/mutant-irq-no-write-readback/os-locking) Finished `test` profile [unoptimized + debuginfo] target(s) in 0.44s Running tests/locking.rs (reports/os-implementation/K961-K979-preparation-HHDGYT/mutant-irq-no-write-readback/target/debug/build/turkos-os-locking/36db3b80b1dba7b1/out/locking-36db3b80b1dba7b1) thread 'irq_mask_write_failure_keeps_backend_quarantined' (41475084) panicked at tests/locking.rs:111:5: assertion failed: matches!(state.enter(), Err(Error::Backend)) note: run with `RUST_BACKTRACE=1` environment variable to display a backtrace error: test failed, to rerun pass `--test locking`