running 1 test test ordering_failed_actual_acquisition_and_panic_preserve_graph ... FAILED failures: failures: ordering_failed_actual_acquisition_and_panic_preserve_graph test result: FAILED. 0 passed; 1 failed; 0 ignored; 0 measured; 33 filtered out; finished in 0.00s Compiling turkos-os-locking v0.1.0 (/reports/os-implementation/K961-K979-preparation-HHDGYT/mutant-ordering-failed-acquire-edge-published/os-locking) Finished `test` profile [unoptimized + debuginfo] target(s) in 0.44s Running tests/locking.rs (reports/os-implementation/K961-K979-preparation-HHDGYT/mutant-ordering-failed-acquire-edge-published/target/debug/build/turkos-os-locking/36db3b80b1dba7b1/out/locking-36db3b80b1dba7b1) thread 'ordering_failed_actual_acquisition_and_panic_preserve_graph' (41480341) panicked at tests/locking.rs:1002:9: assertion `left == right` failed left: [2, 0, 0] right: [0, 0, 0] note: run with `RUST_BACKTRACE=1` environment variable to display a backtrace error: test failed, to rerun pass `--test locking`