running 1 test test executable_and_stack_backing_failures_are_distinct ... FAILED failures: ---- executable_and_stack_backing_failures_are_distinct stdout ---- thread 'executable_and_stack_backing_failures_are_distinct' (41253150) panicked at tests/exceptions.rs:390:5: assertion `left == right` failed left: Ok(UserReturn { frame: FrameAddress { address: 1073806496 }, user: User { owner: 7, generation: 2, root: 1342177280, asid: 3 }, entry: 2147483712, stack: 2147500032 }) right: Err(Stack) note: run with `RUST_BACKTRACE=1` environment variable to display a backtrace failures: executable_and_stack_backing_failures_are_distinct test result: FAILED. 0 passed; 1 failed; 0 ignored; 0 measured; 22 filtered out; finished in 0.00s Compiling turkos-os-exceptions v0.1.0 (/reports/os-implementation/K901-K919-preparation-EQ5mcc/mutant-missing-rw-stack/os-exceptions) Finished `test` profile [unoptimized + debuginfo] target(s) in 0.26s Running tests/exceptions.rs (reports/os-implementation/K901-K919-preparation-EQ5mcc/mutant-missing-rw-stack/target/debug/build/turkos-os-exceptions/75414a6222e92fd7/out/exceptions-75414a6222e92fd7) error: test failed, to rerun pass `--test exceptions`