running 1 test test os_shell_dispatch_exact_builtin_names_and_external_prefixes ... FAILED failures: ---- os_shell_dispatch_exact_builtin_names_and_external_prefixes stdout ---- thread 'os_shell_dispatch_exact_builtin_names_and_external_prefixes' (48148979) panicked at tests/dispatch.rs:11:30: called `Result::unwrap()` on an `Err` value: BuiltinArity note: run with `RUST_BACKTRACE=1` environment variable to display a backtrace failures: os_shell_dispatch_exact_builtin_names_and_external_prefixes test result: FAILED. 0 passed; 1 failed; 0 ignored; 0 measured; 2 filtered out; finished in 0.00s Compiling turkos-os-shell-dispatch v0.1.0 (/reports/os-implementation/K1270-dispatch-local-preflight-2R4Dqw/workspace/os-shell-dispatch) Finished `test` profile [unoptimized + debuginfo] target(s) in 0.13s Running tests/dispatch.rs (reports/os-implementation/K1270-dispatch-local-preflight-2R4Dqw/target/debug/build/turkos-os-shell-dispatch/0dde13f037d06953/out/dispatch-0dde13f037d06953) error: test failed, to rerun pass `--test dispatch`