running 1 test test os_gic_teardown_positive ... FAILED failures: failures: os_gic_teardown_positive test result: FAILED. 0 passed; 1 failed; 0 ignored; 0 measured; 25 filtered out; finished in 0.00s Compiling turkos-os-gic v0.1.0 (/reports/os-implementation/K921-K939-preparation-7Bk1ve/mutant-release-active-handler/os-gic) Finished `test` profile [unoptimized + debuginfo] target(s) in 0.38s Running tests/gic.rs (reports/os-implementation/K921-K939-preparation-7Bk1ve/mutant-release-active-handler/target/debug/build/turkos-os-gic/504a3f6ce8f6a297/out/gic-504a3f6ce8f6a297) thread 'os_gic_teardown_positive' (41339968) panicked at tests/gic.rs:434:5: assertion `left == right` failed left: Ok(Released) right: Ok(RetainedActive) note: run with `RUST_BACKTRACE=1` environment variable to display a backtrace error: test failed, to rerun pass `--test gic`