running 1 test test metadata_and_backend_hidden_lease_disagreement_blocks_retirement ... FAILED failures: ---- metadata_and_backend_hidden_lease_disagreement_blocks_retirement stdout ---- thread 'metadata_and_backend_hidden_lease_disagreement_blocks_retirement' (41616647) panicked at tests/deferred_work.rs:761:5: assertion `left == right` failed left: Busy right: Ownership note: run with `RUST_BACKTRACE=1` environment variable to display a backtrace failures: metadata_and_backend_hidden_lease_disagreement_blocks_retirement test result: FAILED. 0 passed; 1 failed; 0 ignored; 0 measured; 27 filtered out; finished in 0.00s Compiling turkos-os-deferred-work v0.1.0 (/reports/os-implementation/K981-K999-preparation-0bsVMr/mutant-missing-before-source-return-audit/os-deferred-work) Finished `test` profile [unoptimized + debuginfo] target(s) in 0.43s Running tests/deferred_work.rs (reports/os-implementation/K981-K999-preparation-0bsVMr/mutant-missing-before-source-return-audit/target/debug/build/turkos-os-deferred-work/bfb4bf5e81b06a44/out/deferred_work-bfb4bf5e81b06a44) error: test failed, to rerun pass `--test deferred_work`