running 1 test test every_vector_source_mode_and_current_level_are_checked ... FAILED failures: ---- every_vector_source_mode_and_current_level_are_checked stdout ---- thread 'every_vector_source_mode_and_current_level_are_checked' (41252000) panicked at tests/exceptions.rs:102:9: assertion `left == right` failed left: Ok(Vector { slot: 0, origin: CurrentSp0, kind: Sync }) right: Err(WrongLevel) note: run with `RUST_BACKTRACE=1` environment variable to display a backtrace failures: every_vector_source_mode_and_current_level_are_checked test result: FAILED. 0 passed; 1 failed; 0 ignored; 0 measured; 22 filtered out; finished in 0.00s Compiling turkos-os-exceptions v0.1.0 (/reports/os-implementation/K901-K919-preparation-EQ5mcc/mutant-wrong-current-el/os-exceptions) warning: unused variable: `current_el` --> src/exceptions.rs:96:34 | 96 | pub fn validate_source(self, current_el: u64, spsr: u64) -> Result<(), Error> { | ^^^^^^^^^^ help: if this is intentional, prefix it with an underscore: `_current_el` | = note: `#[warn(unused_variables)]` (part of `#[warn(unused)]`) on by default warning: `turkos-os-exceptions` (lib) generated 1 warning (run `cargo fix --lib -p turkos-os-exceptions` to apply 1 suggestion) Finished `test` profile [unoptimized + debuginfo] target(s) in 0.26s Running tests/exceptions.rs (reports/os-implementation/K901-K919-preparation-EQ5mcc/mutant-wrong-current-el/target/debug/build/turkos-os-exceptions/75414a6222e92fd7/out/exceptions-75414a6222e92fd7) error: test failed, to rerun pass `--test exceptions`