running 1 test test os_context_switch_callee_saved_negative ... FAILED failures: failures: os_context_switch_callee_saved_negative test result: FAILED. 0 passed; 1 failed; 0 ignored; 0 measured; 32 filtered out; finished in 0.00s Compiling turkos-os-threads v0.1.0 (/reports/os-implementation/K1021-K1039-preparation-EkLAoy/mutant-abi-shift-ignored/os-threads) Compiling turkos-os-exceptions v0.1.0 (/reports/os-implementation/K1021-K1039-preparation-EkLAoy/mutant-abi-shift-ignored/os-exceptions) Compiling turkos-os-context-switch v0.1.0 (/reports/os-implementation/K1021-K1039-preparation-EkLAoy/mutant-abi-shift-ignored/os-context-switch) Finished `test` profile [unoptimized + debuginfo] target(s) in 0.45s Running tests/context.rs (reports/os-implementation/K1021-K1039-preparation-EkLAoy/mutant-abi-shift-ignored/target/debug/build/turkos-os-context-switch/565f4af2be606f38/out/context-565f4af2be606f38) thread 'os_context_switch_callee_saved_negative' (41793246) panicked at tests/context.rs:31:5: assertion failed: matches!(bank.cooperate(a, b, c), Err(Error::Abi)) note: run with `RUST_BACKTRACE=1` environment variable to display a backtrace error: test failed, to rerun pass `--test context`