running 1 test test foreign_context_bank_handle_never_selects_matching_slot_generation ... FAILED failures: failures: foreign_context_bank_handle_never_selects_matching_slot_generation test result: FAILED. 0 passed; 1 failed; 0 ignored; 0 measured; 32 filtered out; finished in 0.00s Compiling turkos-os-threads v0.1.0 (/reports/os-implementation/K1021-K1039-preparation-EkLAoy/mutant-foreign-bank/os-threads) Compiling turkos-os-exceptions v0.1.0 (/reports/os-implementation/K1021-K1039-preparation-EkLAoy/mutant-foreign-bank/os-exceptions) Compiling turkos-os-context-switch v0.1.0 (/reports/os-implementation/K1021-K1039-preparation-EkLAoy/mutant-foreign-bank/os-context-switch) Finished `test` profile [unoptimized + debuginfo] target(s) in 0.42s Running tests/context.rs (reports/os-implementation/K1021-K1039-preparation-EkLAoy/mutant-foreign-bank/target/debug/build/turkos-os-context-switch/429b4a4fe00aa1ec/out/context-429b4a4fe00aa1ec) thread 'foreign_context_bank_handle_never_selects_matching_slot_generation' (41791610) panicked at tests/context.rs:524:5: assertion failed: matches!(first.start(b), Err(Error::Stale)) note: run with `RUST_BACKTRACE=1` environment variable to display a backtrace error: test failed, to rerun pass `--test context`