running 1 test test user_writable_executable_aliases_are_refused_across_all_activatable_roots ... FAILED failures: failures: user_writable_executable_aliases_are_refused_across_all_activatable_roots test result: FAILED. 0 passed; 1 failed; 0 ignored; 0 measured; 13 filtered out; finished in 0.01s Compiling turkos-os-runtime-platform v0.1.0 (/os-runtime-platform) Compiling turkos-os-frame-metadata v0.1.0 (/os-frame-metadata) Compiling turkos-os-page-tables v0.1.0 (/reports/os-implementation/K801-K819-bFalcS/mutant-user-alias-wx/os-page-tables) Compiling turkos-os-frame-authority v0.1.0 (/os-frame-authority) Finished `test` profile [unoptimized + debuginfo] target(s) in 0.56s Running tests/tree.rs (reports/os-implementation/K801-K819-bFalcS/mutant-user-alias-wx/target/debug/build/turkos-os-page-tables/351e0aca2c5181f2/out/tree-351e0aca2c5181f2) thread 'user_writable_executable_aliases_are_refused_across_all_activatable_roots' (41103198) panicked at tests/tree.rs:534:5: assertion `left == right` failed left: Ok(()) right: Err(AliasPermissions) note: run with `RUST_BACKTRACE=1` environment variable to display a backtrace error: test failed, to rerun pass `--test tree`