running 1 test test ordering_multi_source_cycle_publishes_no_prefix_edge ... FAILED failures: failures: ordering_multi_source_cycle_publishes_no_prefix_edge test result: FAILED. 0 passed; 1 failed; 0 ignored; 0 measured; 33 filtered out; finished in 0.00s Compiling turkos-os-locking v0.1.0 (/reports/os-implementation/K961-K979-preparation-HHDGYT/mutant-ordering-prefix-edge-published/os-locking) Finished `test` profile [unoptimized + debuginfo] target(s) in 0.47s Running tests/locking.rs (reports/os-implementation/K961-K979-preparation-HHDGYT/mutant-ordering-prefix-edge-published/target/debug/build/turkos-os-locking/36db3b80b1dba7b1/out/locking-36db3b80b1dba7b1) thread 'ordering_multi_source_cycle_publishes_no_prefix_edge' (41480109) panicked at tests/locking.rs:987:9: assertion `left == right` failed left: [6, 4, 0] right: [4, 4, 0] note: run with `RUST_BACKTRACE=1` environment variable to display a backtrace error: test failed, to rerun pass `--test locking`