running 1 test test os_context_switch_preempt_negative ... FAILED failures: failures: os_context_switch_preempt_negative test result: FAILED. 0 passed; 1 failed; 0 ignored; 0 measured; 32 filtered out; finished in 0.00s Compiling turkos-os-exceptions v0.1.0 (/reports/os-implementation/K1021-K1039-preparation-EkLAoy/mutant-stale-deferred-elr-replayed/os-exceptions) Compiling turkos-os-threads v0.1.0 (/reports/os-implementation/K1021-K1039-preparation-EkLAoy/mutant-stale-deferred-elr-replayed/os-threads) Compiling turkos-os-context-switch v0.1.0 (/reports/os-implementation/K1021-K1039-preparation-EkLAoy/mutant-stale-deferred-elr-replayed/os-context-switch) Finished `test` profile [unoptimized + debuginfo] target(s) in 0.43s Running tests/context.rs (reports/os-implementation/K1021-K1039-preparation-EkLAoy/mutant-stale-deferred-elr-replayed/target/debug/build/turkos-os-context-switch/a75260e7a3c54bb9/out/context-a75260e7a3c54bb9) thread 'os_context_switch_preempt_negative' (41793703) panicked at tests/support/mod.rs:503:5: assertion failed: d.complete().is_ok() note: run with `RUST_BACKTRACE=1` environment variable to display a backtrace error: test failed, to rerun pass `--test context`