running 1 test test stale_page_reference_and_foreign_owner_cannot_map_reused_storage ... FAILED failures: failures: stale_page_reference_and_foreign_owner_cannot_map_reused_storage test result: FAILED. 0 passed; 1 failed; 0 ignored; 0 measured; 13 filtered out; finished in 0.01s Compiling turkos-os-runtime-platform v0.1.0 (/os-runtime-platform) Compiling turkos-os-page-tables v0.1.0 (/reports/os-implementation/K801-K819-bFalcS/mutant-stale-page/os-page-tables) Compiling turkos-os-frame-metadata v0.1.0 (/os-frame-metadata) warning: unused variable: `generation` --> src/tree.rs:233:9 | 233 | generation: u64, | ^^^^^^^^^^ help: if this is intentional, prefix it with an underscore: `_generation` | = note: `#[warn(unused_variables)]` (part of `#[warn(unused)]`) on by default warning: `turkos-os-page-tables` (lib) generated 1 warning (run `cargo fix --lib -p turkos-os-page-tables` to apply 1 suggestion) Compiling turkos-os-frame-authority v0.1.0 (/os-frame-authority) Finished `test` profile [unoptimized + debuginfo] target(s) in 0.55s Running tests/tree.rs (reports/os-implementation/K801-K819-bFalcS/mutant-stale-page/target/debug/build/turkos-os-page-tables/351e0aca2c5181f2/out/tree-351e0aca2c5181f2) thread 'stale_page_reference_and_foreign_owner_cannot_map_reused_storage' (41101893) panicked at tests/tree.rs:438:5: assertion `left == right` failed left: Ok(()) right: Err(Stale) note: run with `RUST_BACKTRACE=1` environment variable to display a backtrace error: test failed, to rerun pass `--test tree`