running 1 test test os_init_startup_failure_retains_owner_until_reverse_rollback ... FAILED failures: ---- os_init_startup_failure_retains_owner_until_reverse_rollback stdout ---- thread 'os_init_startup_failure_retains_owner_until_reverse_rollback' (48045851) panicked at tests/startup.rs:89:5: assertion `left == right` failed left: 1 right: 0 note: run with `RUST_BACKTRACE=1` environment variable to display a backtrace failures: os_init_startup_failure_retains_owner_until_reverse_rollback test result: FAILED. 0 passed; 1 failed; 0 ignored; 0 measured; 2 filtered out; finished in 0.00s Compiling turkos-os-init-startup v0.1.0 (/reports/os-implementation/K1250-startup-local-preflight-dWL0nM/workspace/os-init-startup) Finished `test` profile [unoptimized + debuginfo] target(s) in 0.13s Running tests/startup.rs (reports/os-implementation/K1250-startup-local-preflight-dWL0nM/target/debug/build/turkos-os-init-startup/96e8cd03312c0614/out/startup-96e8cd03312c0614) error: test failed, to rerun pass `--test startup`